Jump to content
The Dark Mod Forums

Search the Community

Showing results for tags 'boost'.



More search options

  • Search By Tags

    Type tags separated by commas.
  • Search By Author

Content Type


Forums

  • General Discussion
    • News & Announcements
    • The Dark Mod
    • Fan Missions
    • Off-Topic
  • Feedback and Support
    • TDM Tech Support
    • DarkRadiant Feedback and Development
    • I want to Help
  • Editing and Design
    • TDM Editors Guild
    • Art Assets
    • Music & SFX

Find results in...

Find results that contain...


Date Created

  • Start

    End


Last Updated

  • Start

    End


Filter by number of...

Joined

  • Start

    End


Group


AIM


MSN


Website URL


ICQ


Yahoo


Jabber


Skype


Location


Interests

Found 1 result

  1. DarkRadiant stopped compiling after a series of system package updates in openSUSE Tumbleweed today. Oddly enough, I get an error related to boost again, although I compile DR with the same Boost version downloaded from the official website and compiled locally (was 1.54, now 1.59 but same issue). Core DR appears to compile, the error is in the filters plugin. Can anyone please take a look and fix this? make[2]: Entering directory '/home/mircea/Games/Quake/TheDarkMod/DarkRadiant_GIT/plugins/filters' CXX XMLFilter.lo CXX BasicFilterSystem.lo CXX filters.lo CXXLD filters.la libtool: warning: '/usr/lib64/gcc/x86_64-suse-linux/5/../../../../lib64/libxml2.la' seems to be moved .libs/XMLFilter.o: In function `boost::re_detail_106000::perl_matcher<__gnu_cxx::__normal_iterator<char const*, std::__cxx11::basic_string<char, std::char_traits<char>, std::allocator<char> > >, std::allocator<boost::sub_match<__gnu_cxx::__normal_iterator<char const*, std::__cxx11::basic_string<char, std::char_traits<char>, std::allocator<char> > > > >, boost::regex_traits<char, boost::cpp_regex_traits<char> > >::unwind_extra_block(bool)': /usr/include/boost/regex/v4/perl_matcher_non_recursive.hpp:1250: undefined reference to `boost::re_detail_106000::put_mem_block(void*)' .libs/XMLFilter.o: In function `boost::cpp_regex_traits<char>::transform_primary(char const*, char const*) const': /usr/include/boost/regex/v4/cpp_regex_traits.hpp:966: undefined reference to `boost::re_detail_106000::cpp_regex_traits_implementation<char>::transform_primary(char const*, char const*) const' .libs/XMLFilter.o: In function `boost::cpp_regex_traits<char>::transform(char const*, char const*) const': /usr/include/boost/regex/v4/cpp_regex_traits.hpp:962: undefined reference to `boost::re_detail_106000::cpp_regex_traits_implementation<char>::transform(char const*, char const*) const' .libs/XMLFilter.o: In function `void boost::re_detail_106000::raise_error<boost::regex_traits_wrapper<boost::regex_traits<char, boost::cpp_regex_traits<char> > > >(boost::regex_traits_wrapper<boost::regex_traits<char, boost::cpp_regex_traits<char> > > const&, boost::regex_constants::error_type)': /usr/include/boost/regex/pattern_except.hpp:75: undefined reference to `boost::re_detail_106000::raise_runtime_error(std::runtime_error const&)' .libs/XMLFilter.o: In function `boost::re_detail_106000::cpp_regex_traits_implementation<char>::error_string(boost::regex_constants::error_type) const': /usr/include/boost/regex/v4/cpp_regex_traits.hpp:449: undefined reference to `boost::re_detail_106000::get_default_error_string(boost::regex_constants::error_type)' .libs/XMLFilter.o: In function `boost::re_detail_106000::perl_matcher<__gnu_cxx::__normal_iterator<char const*, std::__cxx11::basic_string<char, std::char_traits<char>, std::allocator<char> > >, std::allocator<boost::sub_match<__gnu_cxx::__normal_iterator<char const*, std::__cxx11::basic_string<char, std::char_traits<char>, std::allocator<char> > > > >, boost::regex_traits<char, boost::cpp_regex_traits<char> > >::extend_stack()': /usr/include/boost/regex/v4/perl_matcher_non_recursive.hpp:217: undefined reference to `boost::re_detail_106000::get_mem_block()' .libs/XMLFilter.o: In function `boost::re_detail_106000::save_state_init::save_state_init(boost::re_detail_106000::saved_state**, boost::re_detail_106000::saved_state**)': /usr/include/boost/regex/v4/perl_matcher_non_recursive.hpp:107: undefined reference to `boost::re_detail_106000::get_mem_block()' .libs/XMLFilter.o: In function `boost::re_detail_106000::perl_matcher<__gnu_cxx::__normal_iterator<char const*, std::__cxx11::basic_string<char, std::char_traits<char>, std::allocator<char> > >, std::allocator<boost::sub_match<__gnu_cxx::__normal_iterator<char const*, std::__cxx11::basic_string<char, std::char_traits<char>, std::allocator<char> > > > >, boost::regex_traits<char, boost::cpp_regex_traits<char> > >::match_imp()': /usr/include/boost/regex/v4/perl_matcher_common.hpp:214: undefined reference to `boost::re_detail_106000::verify_options(unsigned int, boost::regex_constants::_match_flags)' .libs/XMLFilter.o: In function `boost::re_detail_106000::save_state_init::~save_state_init()': /usr/include/boost/regex/v4/perl_matcher_non_recursive.hpp:115: undefined reference to `boost::re_detail_106000::put_mem_block(void*)' /usr/include/boost/regex/v4/perl_matcher_non_recursive.hpp:115: undefined reference to `boost::re_detail_106000::put_mem_block(void*)' .libs/XMLFilter.o: In function `boost::re_detail_106000::perl_matcher<__gnu_cxx::__normal_iterator<char const*, std::__cxx11::basic_string<char, std::char_traits<char>, std::allocator<char> > >, std::allocator<boost::sub_match<__gnu_cxx::__normal_iterator<char const*, std::__cxx11::basic_string<char, std::char_traits<char>, std::allocator<char> > > > >, boost::regex_traits<char, boost::cpp_regex_traits<char> > >::perl_matcher(__gnu_cxx::__normal_iterator<char const*, std::__cxx11::basic_string<char, std::char_traits<char>, std::allocator<char> > >, __gnu_cxx::__normal_iterator<char const*, std::__cxx11::basic_string<char, std::char_traits<char>, std::allocator<char> > >, boost::match_results<__gnu_cxx::__normal_iterator<char const*, std::__cxx11::basic_string<char, std::char_traits<char>, std::allocator<char> > >, std::allocator<boost::sub_match<__gnu_cxx::__normal_iterator<char const*, std::__cxx11::basic_string<char, std::char_traits<char>, std::allocator<char> > > > > >&, boost::basic_regex<char, boost::regex_traits<char, boost::cpp_regex_traits<char> > > const&, boost::regex_constants::_match_flags, __gnu_cxx::__normal_iterator<char const*, std::__cxx11::basic_string<char, std::char_traits<char>, std::allocator<char> > >)': /usr/include/boost/regex/v4/perl_matcher.hpp:382: undefined reference to `boost::re_detail_106000::perl_matcher<__gnu_cxx::__normal_iterator<char const*, std::__cxx11::basic_string<char, std::char_traits<char>, std::allocator<char> > >, std::allocator<boost::sub_match<__gnu_cxx::__normal_iterator<char const*, std::__cxx11::basic_string<char, std::char_traits<char>, std::allocator<char> > > > >, boost::regex_traits<char, boost::cpp_regex_traits<char> > >::construct_init(boost::basic_regex<char, boost::regex_traits<char, boost::cpp_regex_traits<char> > > const&, boost::regex_constants::_match_flags)' collect2: error: ld returned 1 exit status Makefile:490: recipe for target 'filters.la' failed make[2]: *** [filters.la] Error 1 make[2]: Leaving directory '/home/mircea/Games/Quake/TheDarkMod/DarkRadiant_GIT/plugins/filters' Makefile:446: recipe for target 'install-recursive' failed make[1]: *** [install-recursive] Error 1 make[1]: Leaving directory '/home/mircea/Games/Quake/TheDarkMod/DarkRadiant_GIT/plugins' Makefile:752: recipe for target 'install-recursive' failed make: *** [install-recursive] Error 1
×
×
  • Create New...