Jump to content
The Dark Mod Forums

Search the Community

Showing results for tags 'compilation'.



More search options

  • Search By Tags

    Type tags separated by commas.
  • Search By Author

Content Type


Forums

  • General Discussion
    • News & Announcements
    • The Dark Mod
    • Fan Missions
    • Off-Topic
  • Feedback and Support
    • TDM Tech Support
    • DarkRadiant Feedback and Development
    • I want to Help
  • Editing and Design
    • TDM Editors Guild
    • Art Assets
    • Music & SFX

Find results in...

Find results that contain...


Date Created

  • Start

    End


Last Updated

  • Start

    End


Filter by number of...

Joined

  • Start

    End


Group


AIM


MSN


Website URL


ICQ


Yahoo


Jabber


Skype


Location


Interests

Found 5 results

  1. http://bugs.thedarkmod.com/view.php?id=4742 The latest DarkRadiant commit in https://github.com/codereader/DarkRadiant ( 2ad55e91df66e11c5385ba40cf3615f56f7d00e8 ) fails configuration. Oddly enough the console doesn't output the exact cause, it only complains that Makefile.in cannot be found. I use Linux openSUSE Tumbleweed 64bit. Below is a console log with the commands I ran and the respective output. mircea@linux-qz0r:~/Downloads/DarkRadiant> ./autogen.sh;./configure --prefix=/home/mircea/Downloads/DarkRadiant/install --enable-darkmod-plugins libtoolize: putting auxiliary files in '.'. libtoolize: copying file './ltmain.sh' libtoolize: putting macros in AC_CONFIG_MACRO_DIRS, 'm4'. libtoolize: copying file 'm4/libtool.m4' libtoolize: copying file 'm4/ltoptions.m4' libtoolize: copying file 'm4/ltsugar.m4' libtoolize: copying file 'm4/ltversion.m4' libtoolize: copying file 'm4/lt~obsolete.m4' configure.ac:24: installing './compile' configure.ac:2: installing './missing' configure.ac:336: error: required file 'plugins/eclasstree/Makefile.in' not found configure.ac:336: error: required file 'plugins/entitylist/Makefile.in' not found configure.ac:336: error: required file 'plugins/undo/Makefile.in' not found libs/ddslib/Makefile.am: installing './depcomp' configure: loading site script /usr/share/site/x86_64-unknown-linux-gnu checking for a BSD-compatible install... /usr/bin/install -c checking whether build environment is sane... yes checking for a thread-safe mkdir -p... /usr/bin/mkdir -p checking for gawk... gawk checking whether make sets $(MAKE)... yes checking whether make supports nested variables... yes checking whether make supports nested variables... (cached) yes checking build system type... x86_64-unknown-linux-gnu checking host system type... x86_64-unknown-linux-gnu checking for a sed that does not truncate output... /usr/bin/sed checking whether NLS is requested... yes checking for msgfmt... /usr/bin/msgfmt checking for gmsgfmt... /usr/bin/msgfmt checking for xgettext... /usr/bin/xgettext checking for msgmerge... /usr/bin/msgmerge checking for style of include used by make... GNU checking for gcc... gcc checking whether the C compiler works... yes checking for C compiler default output file name... a.out checking for suffix of executables... checking whether we are cross compiling... no checking for suffix of object files... o checking whether we are using the GNU C compiler... yes checking whether gcc accepts -g... yes checking for gcc option to accept ISO C89... none needed checking whether gcc understands -c and -o together... yes checking dependency style of gcc... gcc3 checking for ld used by GCC... /usr/x86_64-suse-linux/bin/ld checking if the linker (/usr/x86_64-suse-linux/bin/ld) is GNU ld... yes checking for shared library run path origin... done checking how to run the C preprocessor... gcc -E checking for grep that handles long lines and -e... /usr/bin/grep checking for egrep... /usr/bin/grep -E checking for CFPreferencesCopyAppValue... no checking for CFLocaleCopyCurrent... no checking for GNU gettext in libc... yes checking whether to use NLS... yes checking where the gettext function comes from... libc checking for msgfmt... yes checking for msgmerge... yes checking for xgettext... yes checking for g++... g++ checking whether we are using the GNU C++ compiler... yes checking whether g++ accepts -g... yes checking dependency style of g++... gcc3 checking how to print strings... printf checking for a sed that does not truncate output... (cached) /usr/bin/sed checking for fgrep... /usr/bin/grep -F checking for ld used by gcc... /usr/x86_64-suse-linux/bin/ld checking if the linker (/usr/x86_64-suse-linux/bin/ld) is GNU ld... yes checking for BSD- or MS-compatible name lister (nm)... /usr/bin/nm -B checking the name lister (/usr/bin/nm - interface... BSD nm checking whether ln -s works... yes checking the maximum length of command line arguments... 1572864 checking how to convert x86_64-unknown-linux-gnu file names to x86_64-unknown-linux-gnu format... func_convert_file_noop checking how to convert x86_64-unknown-linux-gnu file names to toolchain format... func_convert_file_noop checking for /usr/x86_64-suse-linux/bin/ld option to reload object files... -r checking for objdump... objdump checking how to recognize dependent libraries... pass_all checking for dlltool... no checking how to associate runtime and link libraries... printf %s\n checking for ar... ar checking for archiver @FILE support... @ checking for strip... strip checking for ranlib... ranlib checking command to parse /usr/bin/nm -B output from gcc object... ok checking for sysroot... no checking for a working dd... /usr/bin/dd checking how to truncate binary pipes... /usr/bin/dd bs=4096 count=1 checking for mt... mt checking if mt is a manifest tool... no checking for ANSI C header files... no checking for sys/types.h... yes checking for sys/stat.h... yes checking for stdlib.h... yes checking for string.h... yes checking for memory.h... yes checking for strings.h... yes checking for inttypes.h... yes checking for stdint.h... yes checking for unistd.h... yes checking for dlfcn.h... yes checking for objdir... .libs checking if gcc supports -fno-rtti -fno-exceptions... no checking for gcc option to produce PIC... -fPIC -DPIC checking if gcc PIC flag -fPIC -DPIC works... yes checking if gcc static flag -static works... no checking if gcc supports -c -o file.o... yes checking if gcc supports -c -o file.o... (cached) yes checking whether the gcc linker (/usr/x86_64-suse-linux/bin/ld -m elf_x86_64) supports shared libraries... yes checking whether -lc should be explicitly linked in... no checking dynamic linker characteristics... GNU/Linux ld.so checking how to hardcode library paths into programs... immediate checking whether stripping libraries is possible... yes checking if libtool supports shared libraries... yes checking whether to build shared libraries... yes checking whether to build static libraries... no checking how to run the C++ preprocessor... g++ -E checking for ld used by g++... /usr/x86_64-suse-linux/bin/ld -m elf_x86_64 checking if the linker (/usr/x86_64-suse-linux/bin/ld -m elf_x86_64) is GNU ld... yes checking whether the g++ linker (/usr/x86_64-suse-linux/bin/ld -m elf_x86_64) supports shared libraries... yes checking for g++ option to produce PIC... -fPIC -DPIC checking if g++ PIC flag -fPIC -DPIC works... yes checking if g++ static flag -static works... no checking if g++ supports -c -o file.o... yes checking if g++ supports -c -o file.o... (cached) yes checking whether the g++ linker (/usr/x86_64-suse-linux/bin/ld -m elf_x86_64) supports shared libraries... yes checking dynamic linker characteristics... (cached) GNU/Linux ld.so checking how to hardcode library paths into programs... immediate checking whether g++ supports C++11 features by default... yes checking cstdint usability... yes checking cstdint presence... yes checking for cstdint... yes checking zlib.h usability... yes checking zlib.h presence... yes checking for zlib.h... yes checking for inflateEnd in -lz... yes checking jpeglib.h usability... yes checking jpeglib.h presence... yes checking for jpeglib.h... yes checking for jpeg_start_compress in -ljpeg... yes checking for wx-config... /usr/bin/wx-config checking for wxWidgets version >= 3.0.0... yes (version 3.0.3) checking for wxWidgets static library... no checking for pkg-config... /usr/bin/pkg-config checking pkg-config is at least version 0.9.0... yes checking for libxml-2.0... yes checking for sigc++-2.0... yes checking for libpng... yes checking for ftgl... yes checking GL/glew.h usability... yes checking GL/glew.h presence... yes checking for GL/glew.h... yes checking for main in -lGLEW... yes checking for main in -lGL... yes checking for gluBuild2DMipmaps in -lGLU... yes checking filesystem usability... no checking filesystem presence... no checking for filesystem... no checking experimental/filesystem usability... yes checking experimental/filesystem presence... yes checking for experimental/filesystem... yes configure: Will use std::filesystem instead of boost.filesystem checking for python-config... python-config configure: Checking for pybind11 headers... checking pybind11/pybind11.h usability... no checking pybind11/pybind11.h presence... no checking for pybind11/pybind11.h... no configure: Using the pybind11 headers shipped with the sources configure: Using the fmtlib headers shipped with the sources (header-only mode) checking for main in -ldl... yes checking AL/alut.h usability... yes checking AL/alut.h presence... yes checking for AL/alut.h... yes checking for ov_clear in -lvorbisfile... yes checking for alGetError in -lopenal... yes checking for main in -lalut... yes checking that generated files are newer than configure... done configure: creating ./config.status config.status: creating install/darkradiant.desktop config.status: creating install/i18n//Makefile.in config.status: error: cannot find input file: `Makefile.in' mircea@linux-qz0r:~/Downloads/DarkRadiant>
  2. I recently halfheartedly tried to comile TDM on my Debian Stretch (amd64) system. I didn't succeed, mostly due to the fact that I couldn't find any recent compiling instructions. The file COMPILING.txt just directs to this wiki site which seems terribly outdated and many of the listed dependencies aren't available in recent Debian versions anymore. I tried to just compile it by running scons, but I ran into lots of compilation errors, probably because I missed to do many things, which recent compiling instructions would tell me to do. Did I just not find recent instructions or are there really no recent instructions?
  3. DarkRadiant stopped compiling after a series of system package updates in openSUSE Tumbleweed today. Oddly enough, I get an error related to boost again, although I compile DR with the same Boost version downloaded from the official website and compiled locally (was 1.54, now 1.59 but same issue). Core DR appears to compile, the error is in the filters plugin. Can anyone please take a look and fix this? make[2]: Entering directory '/home/mircea/Games/Quake/TheDarkMod/DarkRadiant_GIT/plugins/filters' CXX XMLFilter.lo CXX BasicFilterSystem.lo CXX filters.lo CXXLD filters.la libtool: warning: '/usr/lib64/gcc/x86_64-suse-linux/5/../../../../lib64/libxml2.la' seems to be moved .libs/XMLFilter.o: In function `boost::re_detail_106000::perl_matcher<__gnu_cxx::__normal_iterator<char const*, std::__cxx11::basic_string<char, std::char_traits<char>, std::allocator<char> > >, std::allocator<boost::sub_match<__gnu_cxx::__normal_iterator<char const*, std::__cxx11::basic_string<char, std::char_traits<char>, std::allocator<char> > > > >, boost::regex_traits<char, boost::cpp_regex_traits<char> > >::unwind_extra_block(bool)': /usr/include/boost/regex/v4/perl_matcher_non_recursive.hpp:1250: undefined reference to `boost::re_detail_106000::put_mem_block(void*)' .libs/XMLFilter.o: In function `boost::cpp_regex_traits<char>::transform_primary(char const*, char const*) const': /usr/include/boost/regex/v4/cpp_regex_traits.hpp:966: undefined reference to `boost::re_detail_106000::cpp_regex_traits_implementation<char>::transform_primary(char const*, char const*) const' .libs/XMLFilter.o: In function `boost::cpp_regex_traits<char>::transform(char const*, char const*) const': /usr/include/boost/regex/v4/cpp_regex_traits.hpp:962: undefined reference to `boost::re_detail_106000::cpp_regex_traits_implementation<char>::transform(char const*, char const*) const' .libs/XMLFilter.o: In function `void boost::re_detail_106000::raise_error<boost::regex_traits_wrapper<boost::regex_traits<char, boost::cpp_regex_traits<char> > > >(boost::regex_traits_wrapper<boost::regex_traits<char, boost::cpp_regex_traits<char> > > const&, boost::regex_constants::error_type)': /usr/include/boost/regex/pattern_except.hpp:75: undefined reference to `boost::re_detail_106000::raise_runtime_error(std::runtime_error const&)' .libs/XMLFilter.o: In function `boost::re_detail_106000::cpp_regex_traits_implementation<char>::error_string(boost::regex_constants::error_type) const': /usr/include/boost/regex/v4/cpp_regex_traits.hpp:449: undefined reference to `boost::re_detail_106000::get_default_error_string(boost::regex_constants::error_type)' .libs/XMLFilter.o: In function `boost::re_detail_106000::perl_matcher<__gnu_cxx::__normal_iterator<char const*, std::__cxx11::basic_string<char, std::char_traits<char>, std::allocator<char> > >, std::allocator<boost::sub_match<__gnu_cxx::__normal_iterator<char const*, std::__cxx11::basic_string<char, std::char_traits<char>, std::allocator<char> > > > >, boost::regex_traits<char, boost::cpp_regex_traits<char> > >::extend_stack()': /usr/include/boost/regex/v4/perl_matcher_non_recursive.hpp:217: undefined reference to `boost::re_detail_106000::get_mem_block()' .libs/XMLFilter.o: In function `boost::re_detail_106000::save_state_init::save_state_init(boost::re_detail_106000::saved_state**, boost::re_detail_106000::saved_state**)': /usr/include/boost/regex/v4/perl_matcher_non_recursive.hpp:107: undefined reference to `boost::re_detail_106000::get_mem_block()' .libs/XMLFilter.o: In function `boost::re_detail_106000::perl_matcher<__gnu_cxx::__normal_iterator<char const*, std::__cxx11::basic_string<char, std::char_traits<char>, std::allocator<char> > >, std::allocator<boost::sub_match<__gnu_cxx::__normal_iterator<char const*, std::__cxx11::basic_string<char, std::char_traits<char>, std::allocator<char> > > > >, boost::regex_traits<char, boost::cpp_regex_traits<char> > >::match_imp()': /usr/include/boost/regex/v4/perl_matcher_common.hpp:214: undefined reference to `boost::re_detail_106000::verify_options(unsigned int, boost::regex_constants::_match_flags)' .libs/XMLFilter.o: In function `boost::re_detail_106000::save_state_init::~save_state_init()': /usr/include/boost/regex/v4/perl_matcher_non_recursive.hpp:115: undefined reference to `boost::re_detail_106000::put_mem_block(void*)' /usr/include/boost/regex/v4/perl_matcher_non_recursive.hpp:115: undefined reference to `boost::re_detail_106000::put_mem_block(void*)' .libs/XMLFilter.o: In function `boost::re_detail_106000::perl_matcher<__gnu_cxx::__normal_iterator<char const*, std::__cxx11::basic_string<char, std::char_traits<char>, std::allocator<char> > >, std::allocator<boost::sub_match<__gnu_cxx::__normal_iterator<char const*, std::__cxx11::basic_string<char, std::char_traits<char>, std::allocator<char> > > > >, boost::regex_traits<char, boost::cpp_regex_traits<char> > >::perl_matcher(__gnu_cxx::__normal_iterator<char const*, std::__cxx11::basic_string<char, std::char_traits<char>, std::allocator<char> > >, __gnu_cxx::__normal_iterator<char const*, std::__cxx11::basic_string<char, std::char_traits<char>, std::allocator<char> > >, boost::match_results<__gnu_cxx::__normal_iterator<char const*, std::__cxx11::basic_string<char, std::char_traits<char>, std::allocator<char> > >, std::allocator<boost::sub_match<__gnu_cxx::__normal_iterator<char const*, std::__cxx11::basic_string<char, std::char_traits<char>, std::allocator<char> > > > > >&, boost::basic_regex<char, boost::regex_traits<char, boost::cpp_regex_traits<char> > > const&, boost::regex_constants::_match_flags, __gnu_cxx::__normal_iterator<char const*, std::__cxx11::basic_string<char, std::char_traits<char>, std::allocator<char> > >)': /usr/include/boost/regex/v4/perl_matcher.hpp:382: undefined reference to `boost::re_detail_106000::perl_matcher<__gnu_cxx::__normal_iterator<char const*, std::__cxx11::basic_string<char, std::char_traits<char>, std::allocator<char> > >, std::allocator<boost::sub_match<__gnu_cxx::__normal_iterator<char const*, std::__cxx11::basic_string<char, std::char_traits<char>, std::allocator<char> > > > >, boost::regex_traits<char, boost::cpp_regex_traits<char> > >::construct_init(boost::basic_regex<char, boost::regex_traits<char, boost::cpp_regex_traits<char> > > const&, boost::regex_constants::_match_flags)' collect2: error: ld returned 1 exit status Makefile:490: recipe for target 'filters.la' failed make[2]: *** [filters.la] Error 1 make[2]: Leaving directory '/home/mircea/Games/Quake/TheDarkMod/DarkRadiant_GIT/plugins/filters' Makefile:446: recipe for target 'install-recursive' failed make[1]: *** [install-recursive] Error 1 make[1]: Leaving directory '/home/mircea/Games/Quake/TheDarkMod/DarkRadiant_GIT/plugins' Makefile:752: recipe for target 'install-recursive' failed make: *** [install-recursive] Error 1
  4. I have recently upgraded from openSUSE 13.2 to openSUSE Tumbleweed. I am able to compile DarkRadiant without any errors, but I can no longer run it. DR will immediately crash at startup when I try to do so. The crash takes place immediately after the menu in which I select the engine path, so it might occur when DR attempts to render something. mircea@linux-qz0r:~/Games/Quake/TheDarkMod/darkmod> /home/mircea/Games/Quake/TheDarkMod/DarkRadiant_GIT/install/bin/darkradiant Segmentation fault (core dumped) mircea@linux-qz0r:~/Games/Quake/TheDarkMod/darkmod> If it's of any help, here is also the darkradiant log: (140385268681216) Started logging to /home/mircea/.darkradiant/darkradiant.log (140385268681216) This is DarkRadiant 2.0.2 x64 (140385268681216) wxWidgets Version: 3.0.2 (140385268681216) ModuleRegistry: Warning! Module with name MainFrame requested but not found! Does anyone know what is happening please, and help me get DR back up and running? Relevant packages are: Boost 1.54.0 (separate), wxWidgets 2.8.12, gcc 5.0, Mesa 11.0.3. I attempted new settings but no change.
  5. I am trying to compile the latest SVN engine, on openSUSE Tumbleweed (via gcc 4.8). Compilation goes well until the end, when the process mysteriously fails for an unexplained reason. The only thing that seems to be printed is the name of the file and something called "Error 1". Anyone else running across this, and knows of a solution? Thanks. cm/CollisionModel_load.cpp: At global scope: cm/CollisionModel_load.cpp:42:13: warning: ‘versioned’ defined but not used [-Wunused-variable] static bool versioned = RegisterVersionedFile("$Id: CollisionModel_load.cpp 6551 2015-10-15 18:48:23Z stevel $"); ^ In file included from include/boost/filesystem/path_traits.hpp:23:0, from include/boost/filesystem/path.hpp:25, from include/boost/filesystem.hpp:16, from framework/../idlib/../idlib/Image.h:29, from framework/../idlib/../idlib/Lib.h:230, from framework/../idlib/precompiled.h:106, from framework/precompiled_engine.h:28: include/boost/system/error_code.hpp:221:36: warning: ‘boost::system::posix_category’ defined but not used [-Wunused-variable] static const error_category & posix_category = generic_category(); ^ include/boost/system/error_code.hpp:222:36: warning: ‘boost::system::errno_ecat’ defined but not used [-Wunused-variable] static const error_category & errno_ecat = generic_category(); ^ include/boost/system/error_code.hpp:223:36: warning: ‘boost::system::native_ecat’ defined but not used [-Wunused-variable] static const error_category & native_ecat = system_category(); ^ scons: *** [build/release/core/cm/CollisionModel_load.o] Error 1 scons: building terminated because of errors.
×
×
  • Create New...