Jump to content
The Dark Mod Forums
Sign in to follow this  
AluminumHaste

Anything other than 16bit 44.1Khz audio causes distortion and feedback buildup

Recommended Posts

I have a Sound BlasterX AE-5, in Windows 7 I can go up to 24bit 192 Khz (pointless, I know).

In 2.07 I could set it there in windows, and everything sounded fine.

 

In latest SVN version (64bit and 32bit), the sound is distorted and there's feedback that continuously builds up.

 

I tried all settings including 24bit 44.1Khz, but that has the same issue. The only combo that works is 16bit 44.1Khz.

 

 


I always assumed I'd taste like boot leather.

 

Share this post


Link to post
Share on other sites

No one? Do you want me to record it with OBS?


I always assumed I'd taste like boot leather.

 

Share this post


Link to post
Share on other sites

Tried, I updated to that revision but can't build:

 

 

1>------ Build started: Project: ExtLibs, Configuration: Release x64 ------
1>amigaos.c
1>asyn-ares.c
1>asyn-thread.c
1>base64.c
1>bundles.c
1>conncache.c
1>connect.c
1>content_encoding.c
1>cookie.c
1>curl_addrinfo.c
1>curl_fnmatch.c
1>curl_gethostname.c
1>curl_gssapi.c
1>curl_memrchr.c
1>curl_multibyte.c
1>curl_ntlm.c
1>e:\darkmodsrc\lib\curl\curl_setup.h(245): fatal error C1083: Cannot open include file: 'windows.h': No such file or directory (compiling source file ..\lib\curl\asyn-ares.c)
1>e:\darkmodsrc\lib\curl\curl_setup.h(245): fatal error C1083: Cannot open include file: 'windows.h': No such file or directory (compiling source file ..\lib\curl\curl_multibyte.c)
1>e:\darkmodsrc\lib\curl\curl_setup.h(245): fatal error C1083: Cannot open include file: 'windows.h': No such file or directory (compiling source file ..\lib\curl\amigaos.c)
1>e:\darkmodsrc\lib\curl\curl_setup.h(245): fatal error C1083: Cannot open include file: 'windows.h': No such file or directory (compiling source file ..\lib\curl\curl_memrchr.c)
1>e:\darkmodsrc\lib\curl\curl_setup.h(245): fatal error C1083: Cannot open include file: 'windows.h': No such file or directory (compiling source file ..\lib\curl\bundles.c)
1>curl_ntlm_core.c
1>e:\darkmodsrc\lib\curl\curl_setup.h(245): fatal error C1083: Cannot open include file: 'windows.h': No such file or directory (compiling source file ..\lib\curl\curl_ntlm.c)
1>e:\darkmodsrc\lib\curl\curl_setup.h(245): fatal error C1083: Cannot open include file: 'windows.h': No such file or directory (compiling source file ..\lib\curl\curl_fnmatch.c)
1>curl_ntlm_msgs.c
1>e:\darkmodsrc\lib\curl\curl_setup.h(245): fatal error C1083: Cannot open include file: 'windows.h': No such file or directory (compiling source file ..\lib\curl\curl_gethostname.c)
1>curl_ntlm_wb.c
1>e:\darkmodsrc\lib\curl\curl_setup.h(245): fatal error C1083: Cannot open include file: 'windows.h': No such file or directory (compiling source file ..\lib\curl\base64.c)
1>curl_rtmp.c
1>e:\darkmodsrc\lib\curl\curl_setup.h(245): fatal error C1083: Cannot open include file: 'windows.h': No such file or directory (compiling source file ..\lib\curl\curl_gssapi.c)
1>e:\darkmodsrc\lib\curl\curl_setup.h(245): fatal error C1083: Cannot open include file: 'windows.h': No such file or directory (compiling source file ..\lib\curl\cookie.c)
1>e:\darkmodsrc\lib\curl\curl_setup.h(245): fatal error C1083: Cannot open include file: 'windows.h': No such file or directory (compiling source file ..\lib\curl\content_encoding.c)
1>e:\darkmodsrc\lib\curl\curl_setup.h(245): fatal error C1083: Cannot open include file: 'windows.h': No such file or directory (compiling source file ..\lib\curl\curl_addrinfo.c)
1>e:\darkmodsrc\lib\curl\curl_setup.h(245): fatal error C1083: Cannot open include file: 'windows.h': No such file or directory (compiling source file ..\lib\curl\asyn-thread.c)
1>e:\darkmodsrc\lib\curl\curl_setup.h(245): fatal error C1083: Cannot open include file: 'windows.h': No such file or directory (compiling source file ..\lib\curl\conncache.c)
1>e:\darkmodsrc\lib\curl\curl_setup.h(245): fatal error C1083: Cannot open include file: 'windows.h': No such file or directory (compiling source file ..\lib\curl\connect.c)
1>curl_sasl.c
1>curl_sasl_sspi.c
1>curl_sspi.c
1>curl_threads.c
1>dict.c
1>dotdot.c
1>easy.c
1>escape.c
1>file.c
1>fileinfo.c
1>formdata.c
1>ftp.c
1>e:\darkmodsrc\lib\curl\curl_setup.h(245): fatal error C1083: Cannot open include file: 'windows.h': No such file or directory (compiling source file ..\lib\curl\curl_rtmp.c)
1>e:\darkmodsrc\lib\curl\curl_setup.h(245): fatal error C1083: Cannot open include file: 'windows.h': No such file or directory (compiling source file ..\lib\curl\curl_sasl.c)
1>e:\darkmodsrc\lib\curl\curl_setup.h(245): fatal error C1083: Cannot open include file: 'windows.h': No such file or directory (compiling source file ..\lib\curl\curl_ntlm_wb.c)
1>e:\darkmodsrc\lib\curl\curl_setup.h(245): fatal error C1083: Cannot open include file: 'windows.h': No such file or directory (compiling source file ..\lib\curl\curl_ntlm_msgs.c)
1>e:\darkmodsrc\lib\curl\curl_setup.h(245): fatal error C1083: Cannot open include file: 'windows.h': No such file or directory (compiling source file ..\lib\curl\curl_ntlm_core.c)
1>ftplistparser.c
1>e:\darkmodsrc\lib\curl\curl_setup.h(245): fatal error C1083: Cannot open include file: 'windows.h': No such file or directory (compiling source file ..\lib\curl\curl_sspi.c)
1>e:\darkmodsrc\lib\curl\curl_setup.h(245): fatal error C1083: Cannot open include file: 'windows.h': No such file or directory (compiling source file ..\lib\curl\curl_sasl_sspi.c)
1>e:\darkmodsrc\lib\curl\curl_setup.h(245): fatal error C1083: Cannot open include file: 'windows.h': No such file or directory (compiling source file ..\lib\curl\curl_threads.c)
1>getenv.c
1>getinfo.c
1>gopher.c
1>hash.c
1>e:\darkmodsrc\lib\curl\curl_setup.h(245): fatal error C1083: Cannot open include file: 'windows.h': No such file or directory (compiling source file ..\lib\curl\dotdot.c)
1>hmac.c
1>hostasyn.c
1>hostcheck.c
1>e:\darkmodsrc\lib\curl\curl_setup.h(245): fatal error C1083: Cannot open include file: 'windows.h': No such file or directory (compiling source file ..\lib\curl\fileinfo.c)
1>hostip.c
1>e:\darkmodsrc\lib\curl\curl_setup.h(245): fatal error C1083: Cannot open include file: 'windows.h': No such file or directory (compiling source file ..\lib\curl\dict.c)
1>e:\darkmodsrc\lib\curl\curl_setup.h(245): fatal error C1083: Cannot open include file: 'windows.h': No such file or directory (compiling source file ..\lib\curl\file.c)
1>e:\darkmodsrc\lib\curl\curl_setup.h(245): fatal error C1083: Cannot open include file: 'windows.h': No such file or directory (compiling source file ..\lib\curl\escape.c)
1>e:\darkmodsrc\lib\curl\curl_setup.h(245): fatal error C1083: Cannot open include file: 'windows.h': No such file or directory (compiling source file ..\lib\curl\easy.c)
1>e:\darkmodsrc\lib\curl\curl_setup.h(245): fatal error C1083: Cannot open include file: 'windows.h': No such file or directory (compiling source file ..\lib\curl\formdata.c)
1>e:\darkmodsrc\lib\curl\curl_setup.h(245): fatal error C1083: Cannot open include file: 'windows.h': No such file or directory (compiling source file ..\lib\curl\ftp.c)
1>hostip4.c
1>hostip6.c
1>hostsyn.c
1>http.c
1>http2.c
1>http_chunks.c
1>http_digest.c
1>e:\darkmodsrc\lib\curl\curl_setup.h(245): fatal error C1083: Cannot open include file: 'windows.h': No such file or directory (compiling source file ..\lib\curl\ftplistparser.c)
1>e:\darkmodsrc\lib\curl\curl_setup.h(245): fatal error C1083: Cannot open include file: 'windows.h': No such file or directory (compiling source file ..\lib\curl\getenv.c)
1>http_negotiate.c
1>http_negotiate_sspi.c
1>e:\darkmodsrc\lib\curl\curl_setup.h(245): fatal error C1083: Cannot open include file: 'windows.h': No such file or directory (compiling source file ..\lib\curl\gopher.c)
1>e:\darkmodsrc\lib\curl\curl_setup.h(245): fatal error C1083: Cannot open include file: 'windows.h': No such file or directory (compiling source file ..\lib\curl\hash.c)
1>e:\darkmodsrc\lib\curl\curl_setup.h(245): fatal error C1083: Cannot open include file: 'windows.h': No such file or directory (compiling source file ..\lib\curl\hostasyn.c)
1>e:\darkmodsrc\lib\curl\curl_setup.h(245): fatal error C1083: Cannot open include file: 'windows.h': No such file or directory (compiling source file ..\lib\curl\hmac.c)
1>e:\darkmodsrc\lib\curl\curl_setup.h(245): fatal error C1083: Cannot open include file: 'windows.h': No such file or directory (compiling source file ..\lib\curl\getinfo.c)
1>e:\darkmodsrc\lib\curl\curl_setup.h(245): fatal error C1083: Cannot open include file: 'windows.h': No such file or directory (compiling source file ..\lib\curl\hostip.c)
1>e:\darkmodsrc\lib\curl\curl_setup.h(245): fatal error C1083: Cannot open include file: 'windows.h': No such file or directory (compiling source file ..\lib\curl\hostcheck.c)
1>http_proxy.c
1>e:\darkmodsrc\lib\curl\curl_setup.h(245): fatal error C1083: Cannot open include file: 'windows.h': No such file or directory (compiling source file ..\lib\curl\hostip4.c)
1>idn_win32.c
1>if2ip.c
1>imap.c
1>inet_ntop.c
1>inet_pton.c
1>krb5.c
1>e:\darkmodsrc\lib\curl\curl_setup.h(245): fatal error C1083: Cannot open include file: 'windows.h': No such file or directory (compiling source file ..\lib\curl\hostsyn.c)
1>e:\darkmodsrc\lib\curl\curl_setup.h(245): fatal error C1083: Cannot open include file: 'windows.h': No such file or directory (compiling source file ..\lib\curl\hostip6.c)
1>ldap.c
1>e:\darkmodsrc\lib\curl\curl_setup.h(245): fatal error C1083: Cannot open include file: 'windows.h': No such file or directory (compiling source file ..\lib\curl\http2.c)
1>e:\darkmodsrc\lib\curl\curl_setup.h(245): fatal error C1083: Cannot open include file: 'windows.h': No such file or directory (compiling source file ..\lib\curl\http_digest.c)
1>e:\darkmodsrc\lib\curl\curl_setup.h(245): fatal error C1083: Cannot open include file: 'windows.h': No such file or directory (compiling source file ..\lib\curl\http_chunks.c)
1>e:\darkmodsrc\lib\curl\curl_setup.h(245): fatal error C1083: Cannot open include file: 'windows.h': No such file or directory (compiling source file ..\lib\curl\http.c)
1>llist.c
1>md4.c
1>md5.c
1>memdebug.c
1>mprintf.c
1>multi.c
1>e:\darkmodsrc\lib\curl\curl_setup.h(245): fatal error C1083: Cannot open include file: 'windows.h': No such file or directory (compiling source file ..\lib\curl\http_negotiate_sspi.c)
1>e:\darkmodsrc\lib\curl\curl_setup.h(245): fatal error C1083: Cannot open include file: 'windows.h': No such file or directory (compiling source file ..\lib\curl\http_negotiate.c)
1>netrc.c
1>non-ascii.c
1>e:\darkmodsrc\lib\curl\curl_setup.h(245): fatal error C1083: Cannot open include file: 'windows.h': No such file or directory (compiling source file ..\lib\curl\imap.c)
1>e:\darkmodsrc\lib\curl\curl_setup.h(245): fatal error C1083: Cannot open include file: 'windows.h': No such file or directory (compiling source file ..\lib\curl\inet_ntop.c)
1>e:\darkmodsrc\lib\curl\curl_setup.h(245): fatal error C1083: Cannot open include file: 'windows.h': No such file or directory (compiling source file ..\lib\curl\idn_win32.c)
1>e:\darkmodsrc\lib\curl\curl_setup.h(245): fatal error C1083: Cannot open include file: 'windows.h': No such file or directory (compiling source file ..\lib\curl\http_proxy.c)
1>nonblock.c
1>e:\darkmodsrc\lib\curl\curl_setup.h(245): fatal error C1083: Cannot open include file: 'windows.h': No such file or directory (compiling source file ..\lib\curl\inet_pton.c)
1>nwlib.c
1>nwos.c
1>e:\darkmodsrc\lib\curl\curl_setup.h(245): fatal error C1083: Cannot open include file: 'windows.h': No such file or directory (compiling source file ..\lib\curl\ldap.c)
1>e:\darkmodsrc\lib\curl\curl_setup.h(245): fatal error C1083: Cannot open include file: 'windows.h': No such file or directory (compiling source file ..\lib\curl\if2ip.c)
1>e:\darkmodsrc\lib\curl\curl_setup.h(245): fatal error C1083: Cannot open include file: 'windows.h': No such file or directory (compiling source file ..\lib\curl\krb5.c)
1>openldap.c
1>e:\darkmodsrc\lib\curl\curl_setup.h(245): fatal error C1083: Cannot open include file: 'windows.h': No such file or directory (compiling source file ..\lib\curl\llist.c)
1>parsedate.c
1>e:\darkmodsrc\lib\curl\curl_setup.h(245): fatal error C1083: Cannot open include file: 'windows.h': No such file or directory (compiling source file ..\lib\curl\md4.c)
1>pingpong.c
1>pipeline.c
1>e:\darkmodsrc\lib\curl\curl_setup.h(245): fatal error C1083: Cannot open include file: 'windows.h': No such file or directory (compiling source file ..\lib\curl\mprintf.c)
1>pop3.c
1>e:\darkmodsrc\lib\curl\curl_setup.h(245): fatal error C1083: Cannot open include file: 'windows.h': No such file or directory (compiling source file ..\lib\curl\memdebug.c)
1>e:\darkmodsrc\lib\curl\curl_setup.h(245): fatal error C1083: Cannot open include file: 'windows.h': No such file or directory (compiling source file ..\lib\curl\md5.c)
1>e:\darkmodsrc\lib\curl\curl_setup.h(245): fatal error C1083: Cannot open include file: 'windows.h': No such file or directory (compiling source file ..\lib\curl\multi.c)
1>progress.c
1>rawstr.c
1>rtsp.c
1>security.c
1>select.c
1>sendf.c
1>e:\darkmodsrc\lib\curl\curl_setup.h(245): fatal error C1083: Cannot open include file: 'windows.h': No such file or directory (compiling source file ..\lib\curl\non-ascii.c)
1>e:\darkmodsrc\lib\curl\curl_setup.h(245): fatal error C1083: Cannot open include file: 'windows.h': No such file or directory (compiling source file ..\lib\curl\netrc.c)
1>share.c
1>e:\darkmodsrc\lib\curl\curl_setup.h(245): fatal error C1083: Cannot open include file: 'windows.h': No such file or directory (compiling source file ..\lib\curl\nonblock.c)
1>slist.c
1>e:\darkmodsrc\lib\curl\curl_setup.h(245): fatal error C1083: Cannot open include file: 'windows.h': No such file or directory (compiling source file ..\lib\curl\nwos.c)
1>e:\darkmodsrc\lib\curl\curl_setup.h(245): fatal error C1083: Cannot open include file: 'windows.h': No such file or directory (compiling source file ..\lib\curl\nwlib.c)
1>e:\darkmodsrc\lib\curl\curl_setup.h(245): fatal error C1083: Cannot open include file: 'windows.h': No such file or directory (compiling source file ..\lib\curl\openldap.c)
1>e:\darkmodsrc\lib\curl\curl_setup.h(245): fatal error C1083: Cannot open include file: 'windows.h': No such file or directory (compiling source file ..\lib\curl\parsedate.c)
1>smtp.c
1>socks.c
1>socks_gssapi.c
1>socks_sspi.c
1>speedcheck.c
1>e:\darkmodsrc\lib\curl\curl_setup.h(245): fatal error C1083: Cannot open include file: 'windows.h': No such file or directory (compiling source file ..\lib\curl\pipeline.c)
1>e:\darkmodsrc\lib\curl\curl_setup.h(245): fatal error C1083: Cannot open include file: 'windows.h': No such file or directory (compiling source file ..\lib\curl\pingpong.c)
1>splay.c
1>e:\darkmodsrc\lib\curl\curl_setup.h(245): fatal error C1083: Cannot open include file: 'windows.h': No such file or directory (compiling source file ..\lib\curl\progress.c)
1>e:\darkmodsrc\lib\curl\curl_setup.h(245): fatal error C1083: Cannot open include file: 'windows.h': No such file or directory (compiling source file ..\lib\curl\pop3.c)
1>e:\darkmodsrc\lib\curl\curl_setup.h(245): fatal error C1083: Cannot open include file: 'windows.h': No such file or directory (compiling source file ..\lib\curl\rawstr.c)
1>ssh.c
1>e:\darkmodsrc\lib\curl\curl_setup.h(245): fatal error C1083: Cannot open include file: 'windows.h': No such file or directory (compiling source file ..\lib\curl\security.c)
1>strdup.c
1>strequal.c
1>e:\darkmodsrc\lib\curl\curl_setup.h(245): fatal error C1083: Cannot open include file: 'windows.h': No such file or directory (compiling source file ..\lib\curl\select.c)
1>e:\darkmodsrc\lib\curl\curl_setup.h(245): fatal error C1083: Cannot open include file: 'windows.h': No such file or directory (compiling source file ..\lib\curl\sendf.c)
1>strerror.c
1>e:\darkmodsrc\lib\curl\curl_setup.h(245): fatal error C1083: Cannot open include file: 'windows.h': No such file or directory (compiling source file ..\lib\curl\rtsp.c)
1>strtok.c
1>strtoofft.c
1>telnet.c
1>tftp.c
1>e:\darkmodsrc\lib\curl\curl_setup.h(245): fatal error C1083: Cannot open include file: 'windows.h': No such file or directory (compiling source file ..\lib\curl\share.c)
1>e:\darkmodsrc\lib\curl\curl_setup.h(245): fatal error C1083: Cannot open include file: 'windows.h': No such file or directory (compiling source file ..\lib\curl\slist.c)
1>timeval.c
1>transfer.c
1>e:\darkmodsrc\lib\curl\curl_setup.h(245): fatal error C1083: Cannot open include file: 'windows.h': No such file or directory (compiling source file ..\lib\curl\smtp.c)
1>e:\darkmodsrc\lib\curl\curl_setup.h(245): fatal error C1083: Cannot open include file: 'windows.h': No such file or directory (compiling source file ..\lib\curl\socks_gssapi.c)
1>e:\darkmodsrc\lib\curl\curl_setup.h(245): fatal error C1083: Cannot open include file: 'windows.h': No such file or directory (compiling source file ..\lib\curl\socks.c)
1>url.c
1>version.c
1>e:\darkmodsrc\lib\curl\curl_setup.h(245): fatal error C1083: Cannot open include file: 'windows.h': No such file or directory (compiling source file ..\lib\curl\socks_sspi.c)
1>e:\darkmodsrc\lib\curl\curl_setup.h(245): fatal error C1083: Cannot open include file: 'windows.h': No such file or directory (compiling source file ..\lib\curl\speedcheck.c)
1>e:\darkmodsrc\lib\curl\curl_setup.h(245): fatal error C1083: Cannot open include file: 'windows.h': No such file or directory (compiling source file ..\lib\curl\splay.c)
1>axtls.c
1>curl_darwinssl.c
1>curl_schannel.c
1>cyassl.c
1>e:\darkmodsrc\lib\curl\curl_setup.h(245): fatal error C1083: Cannot open include file: 'windows.h': No such file or directory (compiling source file ..\lib\curl\ssh.c)
1>gskit.c
1>e:\darkmodsrc\lib\curl\curl_setup.h(245): fatal error C1083: Cannot open include file: 'windows.h': No such file or directory (compiling source file ..\lib\curl\strdup.c)
1>e:\darkmodsrc\lib\curl\curl_setup.h(245): fatal error C1083: Cannot open include file: 'windows.h': No such file or directory (compiling source file ..\lib\curl\strequal.c)
1>e:\darkmodsrc\lib\curl\curl_setup.h(245): fatal error C1083: Cannot open include file: 'windows.h': No such file or directory (compiling source file ..\lib\curl\strerror.c)
1>e:\darkmodsrc\lib\curl\curl_setup.h(245): fatal error C1083: Cannot open include file: 'windows.h': No such file or directory (compiling source file ..\lib\curl\strtoofft.c)
1>gtls.c
1>nss.c
1>e:\darkmodsrc\lib\curl\curl_setup.h(245): fatal error C1083: Cannot open include file: 'windows.h': No such file or directory (compiling source file ..\lib\curl\telnet.c)
1>e:\darkmodsrc\lib\curl\curl_setup.h(245): fatal error C1083: Cannot open include file: 'windows.h': No such file or directory (compiling source file ..\lib\curl\tftp.c)
1>openssl.c
1>e:\darkmodsrc\lib\curl\curl_setup.h(245): fatal error C1083: Cannot open include file: 'windows.h': No such file or directory (compiling source file ..\lib\curl\strtok.c)
1>polarssl.c
1>e:\darkmodsrc\lib\curl\curl_setup.h(245): fatal error C1083: Cannot open include file: 'windows.h': No such file or directory (compiling source file ..\lib\curl\transfer.c)
1>e:\darkmodsrc\lib\curl\curl_setup.h(245): fatal error C1083: Cannot open include file: 'windows.h': No such file or directory (compiling source file ..\lib\curl\timeval.c)
1>polarssl_threadlock.c
1>vtls.c
1>warnless.c
1>wildcard.c
1>x509asn1.c
1>e:\darkmodsrc\lib\curl\curl_setup.h(245): fatal error C1083: Cannot open include file: 'windows.h': No such file or directory (compiling source file ..\lib\curl\url.c)
1>e:\darkmodsrc\lib\curl\curl_setup.h(245): fatal error C1083: Cannot open include file: 'windows.h': No such file or directory (compiling source file ..\lib\curl\version.c)
1>e:\darkmodsrc\lib\curl\curl_setup.h(245): fatal error C1083: Cannot open include file: 'windows.h': No such file or directory (compiling source file ..\lib\curl\vtls\axtls.c)
1>cdjpeg.c
1>e:\darkmodsrc\lib\curl\curl_setup.h(245): fatal error C1083: Cannot open include file: 'windows.h': No such file or directory (compiling source file ..\lib\curl\vtls\curl_schannel.c)
1>jaricom.c
1>e:\darkmodsrc\lib\curl\curl_setup.h(245): fatal error C1083: Cannot open include file: 'windows.h': No such file or directory (compiling source file ..\lib\curl\vtls\curl_darwinssl.c)
1>e:\darkmodsrc\lib\curl\curl_setup.h(245): fatal error C1083: Cannot open include file: 'windows.h': No such file or directory (compiling source file ..\lib\curl\vtls\cyassl.c)
1>jcapimin.c
1>e:\darkmodsrc\lib\curl\curl_setup.h(245): fatal error C1083: Cannot open include file: 'windows.h': No such file or directory (compiling source file ..\lib\curl\vtls\gskit.c)
1>jcapistd.c
1>jcarith.c
1>jccoefct.c
1>jccolor.c
1>e:\darkmodsrc\lib\curl\curl_setup.h(245): fatal error C1083: Cannot open include file: 'windows.h': No such file or directory (compiling source file ..\lib\curl\vtls\gtls.c)
1>e:\darkmodsrc\lib\curl\curl_setup.h(245): fatal error C1083: Cannot open include file: 'windows.h': No such file or directory (compiling source file ..\lib\curl\vtls\nss.c)
1>jcdctmgr.c
1>jchuff.c
1>e:\darkmodsrc\lib\curl\curl_setup.h(245): fatal error C1083: Cannot open include file: 'windows.h': No such file or directory (compiling source file ..\lib\curl\vtls\polarssl.c)
1>e:\darkmodsrc\lib\curl\curl_setup.h(245): fatal error C1083: Cannot open include file: 'windows.h': No such file or directory (compiling source file ..\lib\curl\vtls\openssl.c)
1>jcinit.c
1>e:\darkmodsrc\lib\curl\curl_setup.h(245): fatal error C1083: Cannot open include file: 'windows.h': No such file or directory (compiling source file ..\lib\curl\vtls\vtls.c)
1>e:\darkmodsrc\lib\curl\curl_setup.h(245): fatal error C1083: Cannot open include file: 'windows.h': No such file or directory (compiling source file ..\lib\curl\warnless.c)
1>e:\darkmodsrc\lib\curl\curl_setup.h(245): fatal error C1083: Cannot open include file: 'windows.h': No such file or directory (compiling source file ..\lib\curl\x509asn1.c)
1>e:\darkmodsrc\lib\curl\curl_setup.h(245): fatal error C1083: Cannot open include file: 'windows.h': No such file or directory (compiling source file ..\lib\curl\vtls\polarssl_threadlock.c)
1>jcmainct.c
1>e:\darkmodsrc\lib\curl\curl_setup.h(245): fatal error C1083: Cannot open include file: 'windows.h': No such file or directory (compiling source file ..\lib\curl\wildcard.c)
1>jcmarker.c
1>jcmaster.c
1>jcomapi.c
1>jcparam.c
1>jcprepct.c
1>e:\darkmodsrc\include\libjpeg\jinclude.h(35): fatal error C1083: Cannot open include file: 'stddef.h': No such file or directory (compiling source file ..\lib\libjpeg\jaricom.c)
1>e:\darkmodsrc\include\libjpeg\jinclude.h(35): fatal error C1083: Cannot open include file: 'stddef.h': No such file or directory (compiling source file ..\lib\libjpeg\cdjpeg.c)
1>e:\darkmodsrc\include\libjpeg\jinclude.h(35): fatal error C1083: Cannot open include file: 'stddef.h': No such file or directory (compiling source file ..\lib\libjpeg\jcapimin.c)
1>jcsample.c
1>jctrans.c
1>jdapimin.c
1>e:\darkmodsrc\include\libjpeg\jinclude.h(35): fatal error C1083: Cannot open include file: 'stddef.h': No such file or directory (compiling source file ..\lib\libjpeg\jcapistd.c)
1>e:\darkmodsrc\include\libjpeg\jinclude.h(35): fatal error C1083: Cannot open include file: 'stddef.h': No such file or directory (compiling source file ..\lib\libjpeg\jccoefct.c)
1>e:\darkmodsrc\include\libjpeg\jinclude.h(35): fatal error C1083: Cannot open include file: 'stddef.h': No such file or directory (compiling source file ..\lib\libjpeg\jcarith.c)
1>jdapistd.c
1>jdarith.c
1>e:\darkmodsrc\include\libjpeg\jinclude.h(35): fatal error C1083: Cannot open include file: 'stddef.h': No such file or directory (compiling source file ..\lib\libjpeg\jccolor.c)
1>e:\darkmodsrc\include\libjpeg\jinclude.h(35): fatal error C1083: Cannot open include file: 'stddef.h': No such file or directory (compiling source file ..\lib\libjpeg\jcdctmgr.c)
1>jdatadst.c
1>e:\darkmodsrc\include\libjpeg\jinclude.h(35): fatal error C1083: Cannot open include file: 'stddef.h': No such file or directory (compiling source file ..\lib\libjpeg\jchuff.c)
1>jdatasrc.c
1>jdcoefct.c
1>jdcolor.c
1>e:\darkmodsrc\include\libjpeg\jinclude.h(35): fatal error C1083: Cannot open include file: 'stddef.h': No such file or directory (compiling source file ..\lib\libjpeg\jcinit.c)
1>jddctmgr.c
1>e:\darkmodsrc\include\libjpeg\jinclude.h(35): fatal error C1083: Cannot open include file: 'stddef.h': No such file or directory (compiling source file ..\lib\libjpeg\jcmainct.c)
1>jdhuff.c
1>e:\darkmodsrc\include\libjpeg\jinclude.h(35): fatal error C1083: Cannot open include file: 'stddef.h': No such file or directory (compiling source file ..\lib\libjpeg\jcprepct.c)
1>e:\darkmodsrc\include\libjpeg\jinclude.h(35): fatal error C1083: Cannot open include file: 'stddef.h': No such file or directory (compiling source file ..\lib\libjpeg\jcmaster.c)
1>e:\darkmodsrc\include\libjpeg\jinclude.h(35): fatal error C1083: Cannot open include file: 'stddef.h': No such file or directory (compiling source file ..\lib\libjpeg\jcmarker.c)
1>e:\darkmodsrc\include\libjpeg\jinclude.h(35): fatal error C1083: Cannot open include file: 'stddef.h': No such file or directory (compiling source file ..\lib\libjpeg\jcomapi.c)
1>e:\darkmodsrc\include\libjpeg\jinclude.h(35): fatal error C1083: Cannot open include file: 'stddef.h': No such file or directory (compiling source file ..\lib\libjpeg\jcparam.c)
1>jdinput.c
1>jdmainct.c
1>jdmarker.c
1>jdmaster.c
1>jdmerge.c
1>e:\darkmodsrc\include\libjpeg\jinclude.h(35): fatal error C1083: Cannot open include file: 'stddef.h': No such file or directory (compiling source file ..\lib\libjpeg\jcsample.c)
1>e:\darkmodsrc\include\libjpeg\jinclude.h(35): fatal error C1083: Cannot open include file: 'stddef.h': No such file or directory (compiling source file ..\lib\libjpeg\jctrans.c)
1>e:\darkmodsrc\include\libjpeg\jinclude.h(35): fatal error C1083: Cannot open include file: 'stddef.h': No such file or directory (compiling source file ..\lib\libjpeg\jdapimin.c)
1>jdpostct.c
1>jdsample.c
1>jdtrans.c
1>e:\darkmodsrc\include\libjpeg\jinclude.h(35): fatal error C1083: Cannot open include file: 'stddef.h': No such file or directory (compiling source file ..\lib\libjpeg\jdapistd.c)
1>e:\darkmodsrc\include\libjpeg\jinclude.h(35): fatal error C1083: Cannot open include file: 'stddef.h': No such file or directory (compiling source file ..\lib\libjpeg\jdarith.c)
1>jerror.c
1>e:\darkmodsrc\include\libjpeg\jinclude.h(35): fatal error C1083: Cannot open include file: 'stddef.h': No such file or directory (compiling source file ..\lib\libjpeg\jdatadst.c)
1>jfdctflt.c
1>e:\darkmodsrc\include\libjpeg\jinclude.h(35): fatal error C1083: Cannot open include file: 'stddef.h': No such file or directory (compiling source file ..\lib\libjpeg\jdcolor.c)
1>e:\darkmodsrc\include\libjpeg\jinclude.h(35): fatal error C1083: Cannot open include file: 'stddef.h': No such file or directory (compiling source file ..\lib\libjpeg\jdcoefct.c)
1>jfdctfst.c
1>jfdctint.c
1>e:\darkmodsrc\include\libjpeg\jinclude.h(35): fatal error C1083: Cannot open include file: 'stddef.h': No such file or directory (compiling source file ..\lib\libjpeg\jdatasrc.c)
1>jidctflt.c
1>jidctfst.c
1>e:\darkmodsrc\include\libjpeg\jinclude.h(35): fatal error C1083: Cannot open include file: 'stddef.h': No such file or directory (compiling source file ..\lib\libjpeg\jddctmgr.c)
1>jidctint.c
1>e:\darkmodsrc\include\libjpeg\jinclude.h(35): fatal error C1083: Cannot open include file: 'stddef.h': No such file or directory (compiling source file ..\lib\libjpeg\jdhuff.c)
1>jmemmgr.c
1>e:\darkmodsrc\include\libjpeg\jinclude.h(35): fatal error C1083: Cannot open include file: 'stddef.h': No such file or directory (compiling source file ..\lib\libjpeg\jdmainct.c)
1>e:\darkmodsrc\include\libjpeg\jinclude.h(35): fatal error C1083: Cannot open include file: 'stddef.h': No such file or directory (compiling source file ..\lib\libjpeg\jdinput.c)
1>e:\darkmodsrc\include\libjpeg\jinclude.h(35): fatal error C1083: Cannot open include file: 'stddef.h': No such file or directory (compiling source file ..\lib\libjpeg\jdmarker.c)
1>e:\darkmodsrc\include\libjpeg\jinclude.h(35): fatal error C1083: Cannot open include file: 'stddef.h': No such file or directory (compiling source file ..\lib\libjpeg\jdmaster.c)
1>e:\darkmodsrc\include\libjpeg\jinclude.h(35): fatal error C1083: Cannot open include file: 'stddef.h': No such file or directory (compiling source file ..\lib\libjpeg\jdmerge.c)
1>e:\darkmodsrc\include\libjpeg\jinclude.h(35): fatal error C1083: Cannot open include file: 'stddef.h': No such file or directory (compiling source file ..\lib\libjpeg\jdsample.c)
1>jmemnobs.c
1>e:\darkmodsrc\include\libjpeg\jinclude.h(35): fatal error C1083: Cannot open include file: 'stddef.h': No such file or directory (compiling source file ..\lib\libjpeg\jdpostct.c)
1>jquant1.c
1>e:\darkmodsrc\include\libjpeg\jinclude.h(35): fatal error C1083: Cannot open include file: 'stddef.h': No such file or directory (compiling source file ..\lib\libjpeg\jerror.c)
1>e:\darkmodsrc\include\libjpeg\jinclude.h(35): fatal error C1083: Cannot open include file: 'stddef.h': No such file or directory (compiling source file ..\lib\libjpeg\jdtrans.c)
1>jquant2.c
1>jutils.c
1>transupp.c
1>e:\darkmodsrc\include\libjpeg\jinclude.h(35): fatal error C1083: Cannot open include file: 'stddef.h': No such file or directory (compiling source file ..\lib\libjpeg\jfdctflt.c)
1>e:\darkmodsrc\include\libjpeg\jinclude.h(35): fatal error C1083: Cannot open include file: 'stddef.h': No such file or directory (compiling source file ..\lib\libjpeg\jfdctfst.c)
1>png.c
1>e:\darkmodsrc\include\libjpeg\jinclude.h(35): fatal error C1083: Cannot open include file: 'stddef.h': No such file or directory (compiling source file ..\lib\libjpeg\jfdctint.c)
1>pngerror.c
1>pngget.c
1>pngmem.c
1>pngpread.c
1>pngread.c
1>pngrio.c
1>e:\darkmodsrc\include\libjpeg\jinclude.h(35): fatal error C1083: Cannot open include file: 'stddef.h': No such file or directory (compiling source file ..\lib\libjpeg\jidctflt.c)
1>e:\darkmodsrc\include\libjpeg\jinclude.h(35): fatal error C1083: Cannot open include file: 'stddef.h': No such file or directory (compiling source file ..\lib\libjpeg\jidctfst.c)
1>e:\darkmodsrc\include\libjpeg\jinclude.h(35): fatal error C1083: Cannot open include file: 'stddef.h': No such file or directory (compiling source file ..\lib\libjpeg\jidctint.c)
1>pngrtran.c
1>pngrutil.c
1>e:\darkmodsrc\include\libjpeg\jinclude.h(35): fatal error C1083: Cannot open include file: 'stddef.h': No such file or directory (compiling source file ..\lib\libjpeg\jmemmgr.c)
1>pngset.c
1>pngtrans.c
1>e:\darkmodsrc\include\zlib\zconf.h(364): fatal error C1083: Cannot open include file: 'sys/types.h': No such file or directory (compiling source file ..\lib\libpng\png.c)
1>e:\darkmodsrc\include\zlib\zconf.h(364): fatal error C1083: Cannot open include file: 'sys/types.h': No such file or directory (compiling source file ..\lib\libpng\pngerror.c)
1>e:\darkmodsrc\include\libjpeg\jinclude.h(35): fatal error C1083: Cannot open include file: 'stddef.h': No such file or directory (compiling source file ..\lib\libjpeg\jquant1.c)
1>e:\darkmodsrc\include\libjpeg\jinclude.h(35): fatal error C1083: Cannot open include file: 'stddef.h': No such file or directory (compiling source file ..\lib\libjpeg\jmemnobs.c)
1>e:\darkmodsrc\include\zlib\zconf.h(364): fatal error C1083: Cannot open include file: 'sys/types.h': No such file or directory (compiling source file ..\lib\libpng\pngmem.c)
1>e:\darkmodsrc\include\zlib\zconf.h(364): fatal error C1083: Cannot open include file: 'sys/types.h': No such file or directory (compiling source file ..\lib\libpng\pngget.c)
1>pngwio.c
1>e:\darkmodsrc\include\zlib\zconf.h(364): fatal error C1083: Cannot open include file: 'sys/types.h': No such file or directory (compiling source file ..\lib\libpng\pngread.c)
1>e:\darkmodsrc\include\libjpeg\jinclude.h(35): fatal error C1083: Cannot open include file: 'stddef.h': No such file or directory (compiling source file ..\lib\libjpeg\jquant2.c)
1>e:\darkmodsrc\include\zlib\zconf.h(364): fatal error C1083: Cannot open include file: 'sys/types.h': No such file or directory (compiling source file ..\lib\libpng\pngrio.c)
1>pngwrite.c
1>e:\darkmodsrc\include\libjpeg\jinclude.h(35): fatal error C1083: Cannot open include file: 'stddef.h': No such file or directory (compiling source file ..\lib\libjpeg\jutils.c)
1>pngwtran.c
1>e:\darkmodsrc\include\libjpeg\jinclude.h(35): fatal error C1083: Cannot open include file: 'stddef.h': No such file or directory (compiling source file ..\lib\libjpeg\transupp.c)
1>e:\darkmodsrc\include\zlib\zconf.h(364): fatal error C1083: Cannot open include file: 'sys/types.h': No such file or directory (compiling source file ..\lib\libpng\pngrutil.c)
1>e:\darkmodsrc\include\zlib\zconf.h(364): fatal error C1083: Cannot open include file: 'sys/types.h': No such file or directory (compiling source file ..\lib\libpng\pngpread.c)
1>e:\darkmodsrc\include\zlib\zconf.h(364): fatal error C1083: Cannot open include file: 'sys/types.h': No such file or directory (compiling source file ..\lib\libpng\pngset.c)
1>pngwutil.c
1>bitwise.c
1>e:\darkmodsrc\include\zlib\zconf.h(364): fatal error C1083: Cannot open include file: 'sys/types.h': No such file or directory (compiling source file ..\lib\libpng\pngrtran.c)
1>framing.c
1>e:\darkmodsrc\include\zlib\zconf.h(364): fatal error C1083: Cannot open include file: 'sys/types.h': No such file or directory (compiling source file ..\lib\libpng\pngtrans.c)
1>analysis.c
1>barkmel.c
1>bitrate.c
1>block.c
1>codebook.c
1>envelope.c
1>floor0.c
1>floor1.c
1>info.c
1>lookup.c
1>e:\darkmodsrc\include\zlib\zconf.h(364): fatal error C1083: Cannot open include file: 'sys/types.h': No such file or directory (compiling source file ..\lib\libpng\pngwio.c)
1>e:\darkmodsrc\include\zlib\zconf.h(364): fatal error C1083: Cannot open include file: 'sys/types.h': No such file or directory (compiling source file ..\lib\libpng\pngwrite.c)
1>lpc.c
1>e:\darkmodsrc\include\zlib\zconf.h(364): fatal error C1083: Cannot open include file: 'sys/types.h': No such file or directory (compiling source file ..\lib\libpng\pngwutil.c)
1>lsp.c
1>e:\darkmodsrc\sound\oggvorbis\oggsrc\bitwise.c(21): fatal error C1083: Cannot open include file: 'string.h': No such file or directory
1>mapping0.c
1>e:\darkmodsrc\include\zlib\zconf.h(364): fatal error C1083: Cannot open include file: 'sys/types.h': No such file or directory (compiling source file ..\lib\libpng\pngwtran.c)
1>e:\darkmodsrc\sound\oggvorbis\oggsrc\framing.c(23): fatal error C1083: Cannot open include file: 'stdlib.h': No such file or directory
1>mdct.c
1>psy.c
1>registry.c
1>e:\darkmodsrc\sound\oggvorbis\vorbissrc\bitrate.c(18): fatal error C1083: Cannot open include file: 'stdio.h': No such file or directory
1>e:\darkmodsrc\sound\oggvorbis\vorbissrc\analysis.c(18): fatal error C1083: Cannot open include file: 'stdio.h': No such file or directory
1>e:\darkmodsrc\sound\oggvorbis\vorbissrc\barkmel.c(18): fatal error C1083: Cannot open include file: 'stdio.h': No such file or directory
1>e:\darkmodsrc\sound\oggvorbis\vorbissrc\block.c(21): fatal error C1083: Cannot open include file: 'stdio.h': No such file or directory
1>res0.c
1>e:\darkmodsrc\sound\oggvorbis\vorbissrc\info.c(21): fatal error C1083: Cannot open include file: 'stdlib.h': No such file or directory
1>sharedbook.c
1>smallft.c
1>synthesis.c
1>e:\darkmodsrc\sound\oggvorbis\vorbissrc\lookup.c(18): fatal error C1083: Cannot open include file: 'math.h': No such file or directory
1>e:\darkmodsrc\sound\oggvorbis\vorbissrc\envelope.c(18): fatal error C1083: Cannot open include file: 'stdlib.h': No such file or directory
1>e:\darkmodsrc\sound\oggvorbis\vorbissrc\codebook.c(18): fatal error C1083: Cannot open include file: 'stdlib.h': No such file or directory
1>e:\darkmodsrc\sound\oggvorbis\vorbissrc\floor0.c(18): fatal error C1083: Cannot open include file: 'stdlib.h': No such file or directory
1>e:\darkmodsrc\sound\oggvorbis\vorbissrc\floor1.c(18): fatal error C1083: Cannot open include file: 'stdlib.h': No such file or directory
1>vorbisenc.c
1>vorbisfile.c
1>windowvb.c
1>ALc.c
1>alcConfig.c
1>alcRing.c
1>e:\darkmodsrc\sound\oggvorbis\vorbissrc\lpc.c(46): fatal error C1083: Cannot open include file: 'stdlib.h': No such file or directory
1>ALu.c
1>e:\darkmodsrc\sound\oggvorbis\vorbissrc\mapping0.c(18): fatal error C1083: Cannot open include file: 'stdlib.h': No such file or directory
1>e:\darkmodsrc\sound\oggvorbis\vorbissrc\lsp.c(35): fatal error C1083: Cannot open include file: 'math.h': No such file or directory
1>e:\darkmodsrc\sound\oggvorbis\vorbissrc\mdct.c(40): fatal error C1083: Cannot open include file: 'stdio.h': No such file or directory
1>ambdec.c
1>base.c
1>e:\darkmodsrc\sound\oggvorbis\vorbissrc\psy.c(18): fatal error C1083: Cannot open include file: 'stdlib.h': No such file or directory
1>loopback.c
1>e:\darkmodsrc\sound\oggvorbis\ogg\os_types.h(26): fatal error C1083: Cannot open include file: 'stddef.h': No such file or directory (compiling source file ..\sound\OggVorbis\vorbissrc\registry.c)
1>mmdevapi.c
1>wave.c
1>e:\darkmodsrc\sound\oggvorbis\vorbissrc\res0.c(23): fatal error C1083: Cannot open include file: 'stdlib.h': No such file or directory
1>e:\darkmodsrc\sound\oggvorbis\vorbissrc\smallft.c(31): fatal error C1083: Cannot open include file: 'stdlib.h': No such file or directory
1>e:\darkmodsrc\sound\oggvorbis\vorbissrc\sharedbook.c(18): fatal error C1083: Cannot open include file: 'stdlib.h': No such file or directory
1>e:\darkmodsrc\sound\oggvorbis\vorbissrc\synthesis.c(18): fatal error C1083: Cannot open include file: 'stdio.h': No such file or directory
1>e:\darkmodsrc\sound\oggvorbis\vorbissrc\vorbisenc.c(18): fatal error C1083: Cannot open include file: 'stdlib.h': No such file or directory
1>winmm.c
1>bformatdec.c
1>bs2b.c
1>converter.c
1>e:\darkmodsrc\sound\oggvorbis\vorbissrc\vorbisfile.c(18): fatal error C1083: Cannot open include file: 'stdlib.h': No such file or directory
1>chorus.c
1>e:\darkmodsrc\extlibs\openal-soft\alc\alcring.c(23): fatal error C1083: Cannot open include file: 'string.h': No such file or directory
1>e:\darkmodsrc\extlibs\openal-soft\alc\alcconfig.c(31): fatal error C1083: Cannot open include file: 'stdlib.h': No such file or directory
1>e:\darkmodsrc\extlibs\openal-soft\alc\alu.c(23): fatal error C1083: Cannot open include file: 'math.h': No such file or directory
1>e:\darkmodsrc\extlibs\openal-soft\alc\alc.c(25): fatal error C1083: Cannot open include file: 'math.h': No such file or directory
1>e:\darkmodsrc\sound\oggvorbis\vorbissrc\windowvb.c(18): fatal error C1083: Cannot open include file: 'stdlib.h': No such file or directory
1>compressor.c
1>e:\darkmodsrc\extlibs\openal-soft\alc\alstring.h(4): fatal error C1083: Cannot open include file: 'string.h': No such file or directory (compiling source file openal-soft\Alc\ambdec.c)
1>e:\darkmodsrc\extlibs\openal-soft\alc\backends\base.c(4): fatal error C1083: Cannot open include file: 'stdlib.h': No such file or directory
1>dedicated.c
1>distortion.c
1>echo.c
1>equalizer.c
1>flanger.c
1>modulator.c
1>reverb.c
1>e:\darkmodsrc\extlibs\openal-soft\alc\backends\mmdevapi.c(24): fatal error C1083: Cannot open include file: 'stdlib.h': No such file or directory
1>e:\darkmodsrc\extlibs\openal-soft\alc\backends\loopback.c(23): fatal error C1083: Cannot open include file: 'stdlib.h': No such file or directory
1>e:\darkmodsrc\extlibs\openal-soft\alc\backends\wave.c(23): fatal error C1083: Cannot open include file: 'stdlib.h': No such file or directory
1>helpers.c
1>hrtf.c
1>mastering.c
1>e:\darkmodsrc\extlibs\openal-soft\alc\bs2b.c(26): fatal error C1083: Cannot open include file: 'math.h': No such file or directory
1>e:\darkmodsrc\extlibs\openal-soft\openal32\include\almain.h(4): fatal error C1083: Cannot open include file: 'string.h': No such file or directory (compiling source file openal-soft\Alc\bformatdec.c)
1>e:\darkmodsrc\extlibs\openal-soft\alc\backends\winmm.c(23): fatal error C1083: Cannot open include file: 'stdlib.h': No such file or directory
1>e:\darkmodsrc\extlibs\openal-soft\openal32\include\almain.h(4): fatal error C1083: Cannot open include file: 'string.h': No such file or directory (compiling source file openal-soft\Alc\converter.c)
1>mixer.c
1>mixer_c.c
1>mixer_sse.c
1>e:\darkmodsrc\extlibs\openal-soft\alc\effects\chorus.c(23): fatal error C1083: Cannot open include file: 'math.h': No such file or directory
1>e:\darkmodsrc\extlibs\openal-soft\alc\effects\compressor.c(21): fatal error C1083: Cannot open include file: 'stdlib.h': No such file or directory
1>mixer_sse2.c
1>mixer_sse3.c
1>e:\darkmodsrc\extlibs\openal-soft\alc\effects\dedicated.c(23): fatal error C1083: Cannot open include file: 'stdlib.h': No such file or directory
1>mixer_sse41.c
1>e:\darkmodsrc\extlibs\openal-soft\alc\effects\distortion.c(23): fatal error C1083: Cannot open include file: 'math.h': No such file or directory
1>nfcfilter.c
1>e:\darkmodsrc\extlibs\openal-soft\alc\effects\equalizer.c(23): fatal error C1083: Cannot open include file: 'math.h': No such file or directory
1>e:\darkmodsrc\extlibs\openal-soft\alc\effects\echo.c(23): fatal error C1083: Cannot open include file: 'math.h': No such file or directory
1>e:\darkmodsrc\extlibs\openal-soft\alc\effects\reverb.c(23): fatal error C1083: Cannot open include file: 'stdio.h': No such file or directory
1>e:\darkmodsrc\extlibs\openal-soft\alc\effects\modulator.c(23): fatal error C1083: Cannot open include file: 'math.h': No such file or directory
1>e:\darkmodsrc\extlibs\openal-soft\alc\effects\flanger.c(23): fatal error C1083: Cannot open include file: 'math.h': No such file or directory
1>panning.c
1>uhjfilter.c
1>almalloc.c
1>atomic.c
1>rwlock.c
1>threads.c
1>e:\darkmodsrc\extlibs\openal-soft\alc\helpers.c(31): fatal error C1083: Cannot open include file: 'stdlib.h': No such file or directory
1>e:\darkmodsrc\extlibs\openal-soft\alc\hrtf.c(23): fatal error C1083: Cannot open include file: 'stdlib.h': No such file or directory
1>e:\darkmodsrc\extlibs\openal-soft\alc\mastering.c(3): fatal error C1083: Cannot open include file: 'math.h': No such file or directory
1>uintmap.c
1>alAuxEffectSlot.c
1>alBuffer.c
1>e:\darkmodsrc\extlibs\openal-soft\alc\mixer.c(23): fatal error C1083: Cannot open include file: 'math.h': No such file or directory
1>e:\darkmodsrc\extlibs\openal-soft\alc\mixer_c.c(3): fatal error C1083: Cannot open include file: 'assert.h': No such file or directory
1>alEffect.c
1>c:\program files (x86)\microsoft visual studio\2017\community\vc\tools\msvc\14.16.27023\include\xmmintrin.h(79): fatal error C1083: Cannot open include file: 'malloc.h': No such file or directory (compiling source file openal-soft\Alc\mixer_sse.c)
1>alError.c
1>c:\program files (x86)\microsoft visual studio\2017\community\vc\tools\msvc\14.16.27023\include\xmmintrin.h(79): fatal error C1083: Cannot open include file: 'malloc.h': No such file or directory (compiling source file openal-soft\Alc\mixer_sse2.c)
1>alExtension.c
1>e:\darkmodsrc\extlibs\openal-soft\openal32\include\almain.h(4): fatal error C1083: Cannot open include file: 'string.h': No such file or directory (compiling source file openal-soft\Alc\nfcfilter.c)
1>c:\program files (x86)\microsoft visual studio\2017\community\vc\tools\msvc\14.16.27023\include\xmmintrin.h(79): fatal error C1083: Cannot open include file: 'malloc.h': No such file or directory (compiling source file openal-soft\Alc\mixer_sse41.c)
1>c:\program files (x86)\microsoft visual studio\2017\community\vc\tools\msvc\14.16.27023\include\xmmintrin.h(79): fatal error C1083: Cannot open include file: 'malloc.h': No such file or directory (compiling source file openal-soft\Alc\mixer_sse3.c)
1>alFilter.c
1>e:\darkmodsrc\extlibs\openal-soft\alc\panning.c(23): fatal error C1083: Cannot open include file: 'math.h': No such file or directory
1>alListener.c
1>alSource.c
1>alState.c
1>alThunk.c
1>e:\darkmodsrc\extlibs\openal-soft\common\almalloc.h(4): fatal error C1083: Cannot open include file: 'stddef.h': No such file or directory (compiling source file openal-soft\common\almalloc.c)
1>e:\darkmodsrc\extlibs\openal-soft\common\static_assert.h(4): fatal error C1083: Cannot open include file: 'assert.h': No such file or directory (compiling source file openal-soft\common\atomic.c)
1>e:\darkmodsrc\extlibs\openal-soft\openal32\include\alu.h(5): fatal error C1083: Cannot open include file: 'math.h': No such file or directory (compiling source file openal-soft\Alc\uhjfilter.c)
1>e:\darkmodsrc\extlibs\openal-soft\common\static_assert.h(4): fatal error C1083: Cannot open include file: 'assert.h': No such file or directory (compiling source file openal-soft\common\rwlock.c)
1>sample_cvt.c
1>e:\darkmodsrc\extlibs\openal-soft\common\threads.h(4): fatal error C1083: Cannot open include file: 'time.h': No such file or directory (compiling source file openal-soft\common\threads.c)
1>e:\darkmodsrc\extlibs\openal-soft\openal32\alauxeffectslot.c(23): fatal error C1083: Cannot open include file: 'stdlib.h': No such file or directory
1>e:\darkmodsrc\extlibs\openal-soft\openal32\albuffer.c(23): fatal error C1083: Cannot open include file: 'stdlib.h': No such file or directory
1>e:\darkmodsrc\extlibs\openal-soft\common\static_assert.h(4): fatal error C1083: Cannot open include file: 'assert.h': No such file or directory (compiling source file openal-soft\common\uintmap.c)
1>e:\darkmodsrc\extlibs\openal-soft\openal32\aleffect.c(23): fatal error C1083: Cannot open include file: 'stdlib.h': No such file or directory
1>e:\darkmodsrc\extlibs\openal-soft\openal32\alerror.c(23): fatal error C1083: Cannot open include file: 'signal.h': No such file or directory
1>e:\darkmodsrc\extlibs\openal-soft\openal32\alextension.c(23): fatal error C1083: Cannot open include file: 'stdlib.h': No such file or directory
1>e:\darkmodsrc\extlibs\openal-soft\openal32\alfilter.c(23): fatal error C1083: Cannot open include file: 'stdlib.h': No such file or directory
1>e:\darkmodsrc\extlibs\openal-soft\openal32\include\almain.h(4): fatal error C1083: Cannot open include file: 'string.h': No such file or directory (compiling source file openal-soft\OpenAL32\alListener.c)
1>e:\darkmodsrc\extlibs\openal-soft\openal32\alsource.c(23): fatal error C1083: Cannot open include file: 'stdlib.h': No such file or directory
1>e:\darkmodsrc\extlibs\openal-soft\openal32\althunk.c(23): fatal error C1083: Cannot open include file: 'stdlib.h': No such file or directory
1>e:\darkmodsrc\extlibs\openal-soft\openal32\alstate.c(25): fatal error C1083: Cannot open include file: 'stdlib.h': No such file or directory
1>e:\darkmodsrc\extlibs\openal-soft\openal32\include\almain.h(4): fatal error C1083: Cannot open include file: 'string.h': No such file or directory (compiling source file openal-soft\OpenAL32\sample_cvt.c)
1>Done building project "ExtLibs.vcxproj" -- FAILED.
2>------ Build started: Project: idLib, Configuration: Release x64 ------
2>Insert SVN revision number into svnversion.h
2>Inserted SVN revision number into svnversion.h
2>precompiled.cpp
2>c:\program files (x86)\microsoft visual studio\2017\community\vc\tools\msvc\14.16.27023\atlmfc\include\afx.h(62): fatal error C1083: Cannot open include file: 'new.h': No such file or directory
2>Done building project "idlib.vcxproj" -- FAILED.
3>------ Build started: Project: TypeInfo, Configuration: Release x64 ------
4>------ Skipped Build: Project: MayaImport, Configuration: Release x64 ------
4>Project not selected to build for this solution configuration
3>ioapi.c
3>e:\darkmodsrc\framework\minizip\ioapi.h(47): fatal error C1083: Cannot open include file: 'stdio.h': No such file or directory
3>Done building project "typeinfo.vcxproj" -- FAILED.
5>------ Build started: Project: DarkModTools, Configuration: Release x64 ------
5>precompiled.cpp
5>c:\program files (x86)\microsoft visual studio\2017\community\vc\tools\msvc\14.16.27023\atlmfc\include\afx.h(62): fatal error C1083: Cannot open include file: 'new.h': No such file or directory
5>Done building project "engine.vcxproj" -- FAILED.
========== Build: 0 succeeded, 4 failed, 0 up-to-date, 1 skipped ==========

I always assumed I'd taste like boot leather.

 

Share this post


Link to post
Share on other sites

Can anyone else try to confirm this?

In windows, if you right click on the volume icon, and pick Playback Devices, right click on your default device, and pick Properties.

Under Advanced tab, and change default format to like 24bit, 48Khz or something and see if you get any distortion.


I always assumed I'd taste like boot leather.

 

Share this post


Link to post
Share on other sites

My audio card is set to 16bit, 48kHz. I have not had any problems so far.

 

Platform?

TDM version?


I always assumed I'd taste like boot leather.

 

Share this post


Link to post
Share on other sites

About build errors: I think you miss the proper Windows SDK.

Did you build TDM at that time?

I guess it needed Windows 7 SDK to be installed, with XP compatibility included.

 

UPDATE: I guess I have 48KHz, 24 bit.

At least this is what Realtek HD settings show me as "standard format".

I don't hear any problems.

Share this post


Link to post
Share on other sites

Okay, interesting thanks.

2.07 works fine with all settings.

 

I changed the build target for the projects to v141 with no XP support as I don't have those tools installed. That might be causing problems. I'll try downloading the XP compat package tonight.


I always assumed I'd taste like boot leather.

 

Share this post


Link to post
Share on other sites

Okay, that worked, I installed the XP tools and was able to compile successfully and audio is working fine all the way up to 24bit 192Khz (Windows 7 max).

I'm trying Revision 8158 now to see if the OpenAL update was the cause.


I always assumed I'd taste like boot leather.

 

Share this post


Link to post
Share on other sites

At revision 8158 is where the problem occurs, must be something in the revision.


I always assumed I'd taste like boot leather.

 

Share this post


Link to post
Share on other sites

At revision 8158 is where the problem occurs, must be something in the revision.

Did you change alsoft.ini ?

You can try to change config settings --- maybe it would help.

 

Also, try to downgrade OpenAL locally.

Here is the link for artefacts of version 1.18.2 (instead of 1.19.0).

Replace contents of \ThirdParty\artefacts\openal with contents of the archive and rebuild TDM.

  • Like 1

Share this post


Link to post
Share on other sites

Did you change alsoft.ini ?

You can try to change config settings --- maybe it would help.

 

Also, try to downgrade OpenAL locally.

Here is the link for artefacts of version 1.18.2 (instead of 1.19.0).

Replace contents of \ThirdParty\artefacts\openal with contents of the archive and rebuild TDM.

 

I checked config settings, but I don't see anything that might help.

 

I tried downgrading the local copy and that fixed the issue.

What next?


I always assumed I'd taste like boot leather.

 

Share this post


Link to post
Share on other sites
On 6/11/2019 at 4:23 AM, AluminumHaste said:

I tried downgrading the local copy and that fixed the issue.

What next?

Sad news.

I will make this downgrade permanent when SVN is up.

 

One question remaining: can we somehow report this error to OpenAL-soft? Civil duty, you know.

I see two problems about bugreport: 1) you are the only one who has the problem, 2) the only "way to reproduce" now is to build and run TDM, which is not fun for a foreigner.

Share this post


Link to post
Share on other sites

Also, I'm using a Creative card, a SoundblasterX AE-5, it could be related to my hardware.

And as we know, Creative's software/driver support is garbage.


I always assumed I'd taste like boot leather.

 

Share this post


Link to post
Share on other sites
1 hour ago, AluminumHaste said:

Also, I'm using a Creative card, a SoundblasterX AE-5, it could be related to my hardware.

I also have Creative card "SB Audigy 4". It is the oldest piece of metal in my machine, coming from the old times when I played Thief 3 :rolleyes:

Note that OpenAL-Soft performs all the complicated processing itself, only passing raw data to sound API. The sound driver should have very basic workflow in this case, although it can of course mess things up.

 

Could you please switch back to buggy build and try changing options in alsoft.ini?

First of all, try to disable HRTF, and probably EFX/EAX also (in-game).

Then, try switching to different backends: find drivers, uncomment it, and try values: mmdevapi, dsound, winmm.

You can also find frequency/precision settings there and set the ones you have, so that it does not have to autodetect.

If you manage to find some conditions for the problem, it would be great.

 

The changelog for 1.19.0 on official site is not too long, but I have no idea which change might influence this.

Perhaps I'll try to ping maintainer directly: he can decide for himself whether this case deserves his attention or not.

 

P.S. Here is the batch file which enables OpenAL logging:

set ALSOFT_LOGLEVEL=3
set ALSOFT_LOGFILE=openal_log.txt
TheDarkModx64.exe

This way you can review logs to be sure that your config changes have effect.

Share this post


Link to post
Share on other sites

Could we move this forum thread to Tech Support subforums to make it public?

 

Share this post


Link to post
Share on other sites

I wish I could, but SVN isn't working for me right now, I get a 403 forbidden at https://svn.thedarkmod.com/
And a 404 Not Found at https://svn.thedarkmod.com/svn/ and https://svn.thedarkmod.com/svn/darkmod_src/
 

And https://192.99.10.220/svn/darkmod/trunk fails to find host.


I always assumed I'd taste like boot leather.

 

Share this post


Link to post
Share on other sites
On 6/24/2019 at 10:59 PM, stgatilov said:

Could you please switch back to buggy build and try changing options in alsoft.ini? Okay, did that.

First of all, try to disable HRTF, and probably EFX/EAX also (in-game). Disabled both, still have distortion

Then, try switching to different backends: find drivers, uncomment it, and try values: mmdevapi, dsound, winmmmmdevapi and winmm have distortion, EDIT #3: dsound driver sounds normal.

You can also find frequency/precision settings there and set the ones you have, so that it does not have to autodetect. Setting freq to 192,000 hz and precision to 24bit didn't help

The changelog for 1.19.0 on official site is not too long, but I have no idea which change might influence this. I didn't see anything in the changelog either that would help

P.S. Here is the batch file which enables OpenAL logging: I don't know how to implement this batch file, it's not a file. Those CVARs don't exist as far as I can tell.


set ALSOFT_LOGLEVEL=3
set ALSOFT_LOGFILE=openal_log.txt
TheDarkModx64.exe

This way you can review logs to be sure that your config changes have effect.

 

  • Like 1

I always assumed I'd taste like boot leather.

 

Share this post


Link to post
Share on other sites

1.19.1 OpenAL Soft (1 year ago) has some big issues with the resampler.

DO NOT USE anything other than "linear" resampling if you resample (44100 KHz sounds to 48.000 KHz)

My OpenAL Soft config file:

 

[General]
sample-type=int16
channels=surround51rear
frequency=48000
stereo-mode=headphones
hrtf=false
default-hrtf=Built-In 48000hz
drivers="wasapi,-dsound"

 

The last entry forces the WASAPI as backend (it removes "-" the DirectSound backend for OpenAL Soft)
 

Edited by lowenz
  • Like 1

Task is not so much to see what no one has yet seen but to think what nobody has yet thought about that which everybody see. - E.S.

Share this post


Link to post
Share on other sites

And DO NOT USE HRTF with a non-stereo speakers setup (4.1, 5.1, 7.1, etc.)


Task is not so much to see what no one has yet seen but to think what nobody has yet thought about that which everybody see. - E.S.

Share this post


Link to post
Share on other sites

Just committed binaries of OpenAL 1.19.1 to the code repo (svn rev 8438).

Let's hope it will keep everyone happy.

  • Like 1

Share this post


Link to post
Share on other sites

Join the conversation

You can post now and register later. If you have an account, sign in now to post with your account.

Guest
Reply to this topic...

×   Pasted as rich text.   Paste as plain text instead

  Only 75 emoji are allowed.

×   Your link has been automatically embedded.   Display as a link instead

×   Your previous content has been restored.   Clear editor

×   You cannot paste images directly. Upload or insert images from URL.

Sign in to follow this  

×
×
  • Create New...